{"text_format":"3","workbook":"xlsx","n_sheets":4,"sheets":["Iesniegums","Darbu tips","Ielu reģistrs","Koefic"],"not_rendered":{"external_links":1,"defined_names":2},"read":"whole","date_system":"1900"}

{"sheet":"Iesniegums","index":0,"n_rows":67,"n_cols":25,"rows_kept":67,"merged":[[0,0,0,14],[2,0,2,2],[2,3,2,14],[3,0,3,2],[3,3,3,14],[4,0,4,2],[4,3,4,14],[5,0,5,2],[5,3,5,14],[6,0,6,2],[6,3,6,14],[7,0,7,2],[7,3,7,14],[8,0,8,2],[8,3,8,14],[9,0,9,2],[9,3,9,14],[10,0,10,2],[10,3,10,14],[11,0,12,1],[11,3,11,14],[12,3,12,14],[13,0,13,2],[13,3,13,14],[14,0,14,1],[14,3,14,14],[15,0,15,1],[15,3,15,14],[17,1,17,24],[19,0,22,0],[19,1,22,1],[19,2,22,2],[19,3,22,3],[19,4,22,4],[19,5,22,5],[19,6,19,12],[19,16,19,24],[20,6,20,14],[20,15,22,15],[20,16,20,24],[21,6,21,8],[21,9,21,12],[21,16,21,18],[21,19,21,22],[30,0,30,5],[33,1,33,2],[34,1,34,2],[36,1,36,2],[37,1,37,2],[38,1,38,2],[40,1,40,2],[41,1,41,2],[42,1,42,2],[43,1,43,2],[45,0,45,1],[45,2,45,4],[46,0,46,1],[46,2,46,4],[46,10,46,14],[47,0,47,1],[47,2,47,4],[48,0,48,1],[48,2,48,4],[48,10,48,14],[49,0,49,4],[52,0,52,16],[55,0,55,1],[56,0,56,1],[58,0,58,1],[59,0,59,1],[61,0,61,14],[62,0,62,14],[63,0,63,14],[64,0,64,14],[66,0,66,14]]}
["IESNIEGUMS par ielas aizņemšanu"]
[]
["Darbu veicējs"]
["juridiskās personas nosaukums/vārds, uzvārds"]
["vienotais reģistrācijas Nr./personas kods"]
["PVN maksātāja Nr."]
["bankas nosaukums"]
["bankas konta Nr."]
["juridiskā adrese/deklarētā adrese"]
["kontakttālrunis"]
["e-pasts"]
["Līguma paraksttiesīgā persona",null,"vārds, uzvārds"]
[null,null,"amats"]
["Darbu pasūtītājs "]
["Fiziska persona\nJuridiska persona",null,"vārds, uzvārds\nnosaukums"]
["Fiziska persona\nJuridiska persona",null,"personas kods1\nvienotais reģistrācijas Nr., juridiskā adrese"]
[]
[null,"Veicamo darbu apjoms pašvaldības īpašumā"]
[]
["Nr.p.k.","Darbu veikšanas iela","Precizējums \n(posma nosaukums, ielas adrese u.c.)","DARBU VEIDS","Veicamie darbi","Veicamo darbu raksturs","SARKANO LĪNIJU ROBEŽĀS",{"$nulls":9},"ĀRPUS SARKANAJĀM LĪNIJĀM"]
[{"$nulls":6}," IELAS ELEMENTA SEGUMS, PLATĪBA  (m2) ",{"$nulls":8},"KOPĀ (bez PVN)","SEGUMS, PLATĪBA  (m2) "]
[{"$nulls":6},"IETVE VAI GĀJĒJU CEĻŠ",null,null,"BRAUCAMĀ DAĻA",{"$nulls":3},"NOMALE","ZAĻĀ ZONA",null,"IETVE VAI GĀJĒJU CEĻŠ",null,null,"BRAUCAMĀ DAĻA",{"$nulls":3},"NOMALE","ZAĻĀ ZONA"]
[{"$nulls":6},"ASFALTS","BRUĢIS","CITS","ASFALTS","BRUĢIS","GRANTS","CITS","GRANTS","MELNZEME",null,"ASFALTS","BRUĢIS","CITS","ASFALTS","BRUĢIS","GRANTS","CITS","GRANTS","MELNZEME"]
[1,{"$nulls":14},{"$f":"IFERROR((VLOOKUP(B24,'Ielu reģistrs'!$B$2:$H$447,7,FALSE)*SUM(J24:M24)*$D$35)+((SUM(G24:I24)*0.5)*$D$35), 0)","v":{"v":0,"d":"0.00"}}]
[2,{"$nulls":14},{"$f":"IFERROR((VLOOKUP(B25,'Ielu reģistrs'!$B$2:$H$447,7,FALSE)*SUM(J25:M25)*$D$35)+((SUM(G25:I25)*0.5)*$D$35), 0)","v":{"v":0,"d":"0.00"}}]
[3,{"$nulls":14},{"$f":"IFERROR((VLOOKUP(B26,'Ielu reģistrs'!$B$2:$H$447,7,FALSE)*SUM(J26:M26)*$D$35)+((SUM(G26:I26)*0.5)*$D$35), 0)","v":{"v":0,"d":"0.00"}}]
[4,{"$nulls":14},{"$f":"IFERROR((VLOOKUP(B27,'Ielu reģistrs'!$B$2:$H$447,7,FALSE)*SUM(J27:M27)*$D$35)+((SUM(G27:I27)*0.5)*$D$35), 0)","v":{"v":0,"d":"0.00"}}]
[5,{"$nulls":14},{"$f":"IFERROR((VLOOKUP(B28,'Ielu reģistrs'!$B$2:$H$447,7,FALSE)*SUM(J28:M28)*$D$35)+((SUM(G28:I28)*0.5)*$D$35), 0)","v":{"v":0,"d":"0.00"}}]
[6,{"$nulls":14},{"$f":"IFERROR((VLOOKUP(B29,'Ielu reģistrs'!$B$2:$H$447,7,FALSE)*SUM(J29:M29)*$D$35)+((SUM(G29:I29)*0.5)*$D$35), 0)","v":{"v":0,"d":"0.00"}}]
[7,{"$nulls":14},{"$f":"IFERROR((VLOOKUP(B30,'Ielu reģistrs'!$B$2:$H$447,7,FALSE)*SUM(J30:M30)*$D$35)+((SUM(G30:I30)*0.5)*$D$35), 0)","v":{"v":0,"d":"0.00"}}]
["Kopā:",{"$nulls":5},{"$f":"SUM(G24:G30)","v":0},{"$f":"SUM(H24:H30)","v":0},0,0,0,0,0,0,0,null,0,0,0,0,0,0,0,0,0]
[]
[{"$nulls":3},"DD.MM.GGGG",null,"DD.MM.GGGG"]
[null,"Darbi tiks veikti no",null,null,"līdz"]
[null,"Rakšanas darbu ilgums (dienas)",null,{"$f":"F34+1-D34","v":1}]
[]
[null,"Plānotā nomas maksa, euro bez PVN",null,{"$f":"IF(D43=\"\",0,IF(D43=\"Jā\",0,IF(D42=\"Jā\",0,SUM(P24:P30))))","v":{"v":0,"d":"0.00"}}]
[null,"Plānotā nomas maksa, euro PVN 21%",null,{"$f":"D39-D37","v":{"v":0,"d":"0.00"}}]
[null,"Plānotā nomas maksa, euro ar PVN",null,{"$f":"D37*1.21","v":{"v":0,"d":"0.00"}}]
[]
[null,"Plānoti darbi",null,"Jā"]
[null,"Avārijas darbi",null,{"$f":"IF(D41=\"\",\"\",IF(D41=\"Nē\",\"Jā\",\"Nē\"))","v":"Nē"}]
[null,"Atvieglojumi2",null,"Nē"]
[null,"Vai darbi tiek veikti  kultūras pieminekļu aizsardzības zonā (kultūras pieminekļu teritorijā vai to aizsardzības zonās)",null,"Nē"]
[]
["Apliecinājuma karte Nr."]
["Būvatļauja Nr."]
["Paskaidrojuma raksts Nr."]
["Paziņojums par būvniecību Nr."]
["(Aizpildīt nepieciešamo. Neplānotu avārijas darbu gadījumā aizpildīt nav nepieciešams)"]
[]
[]
["INFORMĀCIJA PAR FIZISKO PERSONU DATU APSTRĀDI: \nEsmu informēts/ta, ka fizisko personas datu apstrādes pārzinis ir Jelgavas valstspilsētas pašvaldība un informācija par personu datu apstrādi pieejama Jelgavas valstspilsētas pašvaldības tīmekļa vietnē www.jelgava.lv vai saņemot informāciju klātienē."]
[]
[]
[{"$nulls":3},"kontakttālrunis"]
["vārds, uzvārds, paraksts3"]
[]
[]
["(datums)"]
[]
["Piezīmes:"]
["1 - aizpilda gadījos, ja paredzēti atvieglojumi personai ar invaliditāti."]
["2 - no maksas atbrīvoti valsts vai pašvaldības institūcija vai kapitālsabiedrība, kurā attiecīgi valsts vai pašvaldība ir 100 % kapitāldaļu turētāja, vai persona, kurai deleģēta valsts vai pašvaldības pārvaldes uzdevumu pildīšana, vai fiziska persona, kurai noteikta I vai II invaliditātes grupa."]
["3 - dokumenta rekvizītus \"paraksts\" un \"datums\" neaizpilda, ja elektroniskais dokuments ir sagatavots atbilstoši normatīvajiem aktiem par elektronisko dokumentu noformēšanu."]
[]
["*ŠIS DOKUMENTS IR ELEKTRONISKI PARAKSTĪTS AR DROŠU ELEKTRONISKO PARAKSTU UN SATUR LAIKA ZĪMOGU"]

{"sheet":"Darbu tips","index":1,"n_rows":27,"n_cols":1,"rows_kept":27,"hidden":true}
[]
["Apgaismojuma tīklu būvdarbi"]
["Bērnu rotaļlaukuma izbūve"]
["Bērnu rotaļu ierīču būvdarbi"]
["Caurtekas būvdarbi"]
["Celmu raušana"]
["Dīķa rakšana/tīrīšana"]
["Dzelzceļa pārbrauktuves būvdarbi"]
["Elektroapgādes tīklu būvdarbi"]
["Gāzesvada būvdarbi"]
["Ģeoloģiskā izpēte – dziļurbumu veikšana"]
["Ielas būvdarbi"]
["Ietves būvdarbi"]
["Koku stādīšana"]
["Labiekārtošanas darbi"]
["Lietus ūdens kanalizācijas būvdarbi"]
["Meliorācijas sistēmas būvdarbi"]
["Optisko tīklu būvdarbi"]
["Saimnieciskās kanalizācijas būvdarbi"]
["Satiksmes organizācijas tehnisko līdzekļu būvdarbi"]
["Siltumtīklu būvdarbi"]
["Tilta būvdarbi"]
["Transformatoru apakšstacijas būvdarbi"]
["Ūdensvada būvdarbi"]
["Ūdensvada un saimnieciskās kanalizācijas būvdarbi"]
["Vājstrāvas tīklu būvdarbi"]
["Citi būvdarbi"]

{"sheet":"Ielu reģistrs","index":2,"n_rows":447,"n_cols":8,"rows_kept":447,"hidden":true}
[null,null,"Klase","eiro/ dienā","Gads","Gadi","Koef.","eiro/dienā ar koef."]
[1,"1. līnijas posms no Dobeles šosejas līdz Ganību ielai","C",1.65,2000,{"$f":"YEAR(TODAY())-E2","v":24},{"$f":"VLOOKUP(F2,[1]Koefic!$A$1:$B$40,2,FALSE)","v":1},{"$f":"D2*G2","v":1.65}]
[2,"1. līnijas posms no Ganību ielas līdz Meiju ceļam","D",0.83,2000,24,{"$f":"VLOOKUP(F3,[1]Koefic!$A$1:$B$40,2,FALSE)","v":1},0.83]
[3,"2.līnijas posms no Dobeles šosejas līdz Nameja ielai","D",0.83,2024,0,{"$f":"VLOOKUP(F4,[1]Koefic!$A$1:$B$40,2,FALSE)","v":5},4.1499999999999995]
[4,"2.līnijas posms no Nameja ielas līdz Ošu ceļam","D",0.83,2024,0,{"$f":"VLOOKUP(F5,[1]Koefic!$A$1:$B$40,2,FALSE)","v":5},4.1499999999999995]
[5,"2.līnijas posms no Ošu ceļa līdz pilsētas administratīvajai robežai","D",0.83,2024,0,{"$f":"VLOOKUP(F6,[1]Koefic!$A$1:$B$40,2,FALSE)","v":5},4.1499999999999995]
[6,"3.līnijas posms no Dobeles šosejas līdz Nameja ielai","D",0.83,2024,0,{"$f":"VLOOKUP(F7,[1]Koefic!$A$1:$B$40,2,FALSE)","v":5},4.1499999999999995]
[7,"3.līnijas posms no Nameja ielas līdz Meža ceļam","D",0.83,2024,0,{"$f":"VLOOKUP(F8,[1]Koefic!$A$1:$B$40,2,FALSE)","v":5},4.1499999999999995]
[8,"4.līnija","C",1.65,2010,14,{"$f":"VLOOKUP(F9,[1]Koefic!$A$1:$B$40,2,FALSE)","v":1},1.65]
[9,"5.līnija","D",0.83,2010,14,{"$f":"VLOOKUP(F10,[1]Koefic!$A$1:$B$40,2,FALSE)","v":1},0.83]
[10,"6.līnija","D",0.83,2010,14,{"$f":"VLOOKUP(F11,[1]Koefic!$A$1:$B$40,2,FALSE)","v":1},0.83]
[11,"Ābelītes iela","D",0.83,2000,24,{"$f":"VLOOKUP(F12,[1]Koefic!$A$1:$B$40,2,FALSE)","v":1},0.83]
[12,"Ābeļu iela","D",0.83,2000,24,{"$f":"VLOOKUP(F13,[1]Koefic!$A$1:$B$40,2,FALSE)","v":1},0.83]
[13,"Agroķīmiķu iela","D",0.83,2000,24,{"$f":"VLOOKUP(F14,[1]Koefic!$A$1:$B$40,2,FALSE)","v":1},0.83]
[14,"Aizsargu iela","A",4.13,2023,1,{"$f":"VLOOKUP(F15,[1]Koefic!$A$1:$B$40,2,FALSE)","v":5},20.65]
[15,"Aizsargu ielas satiksmes rotācijas aplis","A",4.13,2023,1,{"$f":"VLOOKUP(F16,[1]Koefic!$A$1:$B$40,2,FALSE)","v":5},20.65]
[16,"Akāciju iela","D",0.83,2000,24,{"$f":"VLOOKUP(F17,[1]Koefic!$A$1:$B$40,2,FALSE)","v":1},0.83]
[17,"Akadēmijas iela","B",2.48,2010,14,{"$f":"VLOOKUP(F18,[1]Koefic!$A$1:$B$40,2,FALSE)","v":1},2.48]
[18,"Akmeņu ielas posms no Imantas ielas līdz Kronvalda ielai","C",1.65,2021,3,{"$f":"VLOOKUP(F19,[1]Koefic!$A$1:$B$40,2,FALSE)","v":5},8.25]
[19,"Akmeņu ielas posms no Brīvības bulvāra līdz Imantas ielai","C",1.65,2010,14,{"$f":"VLOOKUP(F20,[1]Koefic!$A$1:$B$40,2,FALSE)","v":1},1.65]
[20,"Aku ceļš","D",0.83,2019,5,{"$f":"VLOOKUP(F21,[1]Koefic!$A$1:$B$40,2,FALSE)","v":5},4.1499999999999995]
[21,"Alkšņu iela","D",0.83,2020,4,{"$f":"VLOOKUP(F22,[1]Koefic!$A$1:$B$40,2,FALSE)","v":5},4.1499999999999995]
[22,"Amatu iela","D",0.83,2000,24,{"$f":"VLOOKUP(F23,[1]Koefic!$A$1:$B$40,2,FALSE)","v":1},0.83]
[23,"Apiņu iela","D",0.83,2000,24,{"$f":"VLOOKUP(F24,[1]Koefic!$A$1:$B$40,2,FALSE)","v":1},0.83]
[24,"Apoga iela","D",0.83,2000,24,{"$f":"VLOOKUP(F25,[1]Koefic!$A$1:$B$40,2,FALSE)","v":1},0.83]
[25,"Apšu iela","D",0.83,2000,24,{"$f":"VLOOKUP(F26,[1]Koefic!$A$1:$B$40,2,FALSE)","v":1},0.83]
[26,"Āraišu iela","D",0.83,2000,24,{"$f":"VLOOKUP(F27,[1]Koefic!$A$1:$B$40,2,FALSE)","v":1},0.83]
[27,"Arāju iela","D",0.83,2000,24,{"$f":"VLOOKUP(F28,[1]Koefic!$A$1:$B$40,2,FALSE)","v":1},0.83]
[28,"Aroniju iela","D",0.83,2000,24,{"$f":"VLOOKUP(F29,[1]Koefic!$A$1:$B$40,2,FALSE)","v":1},0.83]
[29,"Asnu iela","D",0.83,2000,24,{"$f":"VLOOKUP(F30,[1]Koefic!$A$1:$B$40,2,FALSE)","v":1},0.83]
[30,"Aspazijas iela","C",1.65,2010,14,{"$f":"VLOOKUP(F31,[1]Koefic!$A$1:$B$40,2,FALSE)","v":1},1.65]
[31,"Asteru iela","C",1.65,2010,14,{"$f":"VLOOKUP(F32,[1]Koefic!$A$1:$B$40,2,FALSE)","v":1},1.65]
[32,"Atmodas ielas posms no Dambja ielas līdz Dobeles šosejai","A",4.13,2017,7,{"$f":"VLOOKUP(F33,[1]Koefic!$A$1:$B$40,2,FALSE)","v":2},8.26]
[33,"Atmodas ielas posms no Ganību ielas līdz Ganību ielai Nr.66","D",0.83,2018,6,{"$f":"VLOOKUP(F34,[1]Koefic!$A$1:$B$40,2,FALSE)","v":2},1.66]
[34,"Atmodas ielas posms no Ganību ielas Nr.66 līdz Meiju ceļam","D",0.83,2017,7,{"$f":"VLOOKUP(F35,[1]Koefic!$A$1:$B$40,2,FALSE)","v":2},1.66]
[35,"Atpūtas iela","D",0.83,2000,24,{"$f":"VLOOKUP(F36,[1]Koefic!$A$1:$B$40,2,FALSE)","v":1},0.83]
[36,"Audēju iela","D",0.83,2000,24,{"$f":"VLOOKUP(F37,[1]Koefic!$A$1:$B$40,2,FALSE)","v":1},0.83]
[37,"Augļudārzu iela","D",0.83,2000,24,{"$f":"VLOOKUP(F38,[1]Koefic!$A$1:$B$40,2,FALSE)","v":1},0.83]
[38,"Augstkalnes iela","D",0.83,2020,4,{"$f":"VLOOKUP(F39,[1]Koefic!$A$1:$B$40,2,FALSE)","v":5},4.1499999999999995]
[39,"Augusta iela","D",0.83,2014,10,{"$f":"VLOOKUP(F40,[1]Koefic!$A$1:$B$40,2,FALSE)","v":2},1.66]
[40,"Ausekļa iela","D",0.83,2000,24,{"$f":"VLOOKUP(F41,[1]Koefic!$A$1:$B$40,2,FALSE)","v":1},0.83]
[41,"Ausmas iela","D",0.83,2000,24,{"$f":"VLOOKUP(F42,[1]Koefic!$A$1:$B$40,2,FALSE)","v":1},0.83]
[42,"Austrumu iela","D",0.83,2000,24,{"$f":"VLOOKUP(F43,[1]Koefic!$A$1:$B$40,2,FALSE)","v":1},0.83]
[43,"Aveņu iela","D",0.83,2000,24,{"$f":"VLOOKUP(F44,[1]Koefic!$A$1:$B$40,2,FALSE)","v":1},0.83]
[44,"Aviācijas ielas posms no Cukura ielas līdz Garozas ielai","D",0.83,2014,10,{"$f":"VLOOKUP(F45,[1]Koefic!$A$1:$B$40,2,FALSE)","v":2},1.66]
[45,"Aviācijas ielas posms no Garozas ielas līdz Loka maģistrālei","B",2.48,2000,24,{"$f":"VLOOKUP(F46,[1]Koefic!$A$1:$B$40,2,FALSE)","v":1},2.48]
[46,"Aviācijas ielas posms no Loka maģistrāles līdz Aviācijas ielai 42","C",1.65,2014,10,{"$f":"VLOOKUP(F47,[1]Koefic!$A$1:$B$40,2,FALSE)","v":2},3.3]
[47,"Avotu iela","D",0.83,2000,24,{"$f":"VLOOKUP(F48,[1]Koefic!$A$1:$B$40,2,FALSE)","v":1},0.83]
[48,"Baldones iela","D",0.83,2000,24,{"$f":"VLOOKUP(F49,[1]Koefic!$A$1:$B$40,2,FALSE)","v":1},0.83]
[49,"Baložu iela","C",1.65,2010,14,{"$f":"VLOOKUP(F50,[1]Koefic!$A$1:$B$40,2,FALSE)","v":1},1.65]
[50,"Bāra ceļš","D",0.83,2000,24,{"$f":"VLOOKUP(F51,[1]Koefic!$A$1:$B$40,2,FALSE)","v":1},0.83]
[51,"Baraviku iela","D",0.83,2000,24,{"$f":"VLOOKUP(F52,[1]Koefic!$A$1:$B$40,2,FALSE)","v":1},0.83]
[52,"Bauskas ielas posms no Lapu ielas līdz Miera ielai","C",1.65,2000,24,{"$f":"VLOOKUP(F53,[1]Koefic!$A$1:$B$40,2,FALSE)","v":1},1.65]
[53,"Bauskas ielas posms no Miera ielas līdz Bauskas ielai 19","C",1.65,2000,24,{"$f":"VLOOKUP(F54,[1]Koefic!$A$1:$B$40,2,FALSE)","v":1},1.65]
[54,"Bauskas ielas posms no Bauskas ielas 19 līdz Valsts reģionālajam autoceļam P94","C",1.65,2024,0,{"$f":"VLOOKUP(F55,[1]Koefic!$A$1:$B$40,2,FALSE)","v":5},8.25]
[55,"Bebru ceļa posms no Dambja ielas līdz Dūņu ielai","D",0.83,2000,24,{"$f":"VLOOKUP(F56,[1]Koefic!$A$1:$B$40,2,FALSE)","v":1},0.83]
[56,"Bebru ceļa posms no Dūņu ielas līdz Smilgu ielai","D",0.83,2017,7,{"$f":"VLOOKUP(F57,[1]Koefic!$A$1:$B$40,2,FALSE)","v":2},1.66]
[57,"Bebru ceļa posms no Smilgu ielas līdz Dambja ielai","D",0.83,2020,4,{"$f":"VLOOKUP(F58,[1]Koefic!$A$1:$B$40,2,FALSE)","v":5},4.1499999999999995]
[58,"Bērzaines iela","D",0.83,2000,24,{"$f":"VLOOKUP(F59,[1]Koefic!$A$1:$B$40,2,FALSE)","v":1},0.83]
[59,"Bērzu ceļa posms no Vecā ceļa līdz Loka maģistrālei","C",1.65,2020,4,{"$f":"VLOOKUP(F60,[1]Koefic!$A$1:$B$40,2,FALSE)","v":5},8.25]
[60,"Bērzu ceļa asfaltētais posms no Loka maģistrāles līdz Bērzu ceļam Nr.46","D",0.83,2020,4,{"$f":"VLOOKUP(F61,[1]Koefic!$A$1:$B$40,2,FALSE)","v":5},4.1499999999999995]
[61,"Bērzu ceļa posms no Bērzu ceļa Nr.46 līdz Klijēnu ceļam","D",0.83,2000,24,{"$f":"VLOOKUP(F62,[1]Koefic!$A$1:$B$40,2,FALSE)","v":1},0.83]
[62,"Biešu iela","D",0.83,2000,24,{"$f":"VLOOKUP(F63,[1]Koefic!$A$1:$B$40,2,FALSE)","v":1},0.83]
[63,"Birzes iela","D",0.83,2021,3,{"$f":"VLOOKUP(F64,[1]Koefic!$A$1:$B$40,2,FALSE)","v":5},4.1499999999999995]
[64,"Bišu iela","D",0.83,2000,24,{"$f":"VLOOKUP(F65,[1]Koefic!$A$1:$B$40,2,FALSE)","v":1},0.83]
[65,"Blaumaņa iela","B",2.48,2000,{"$f":"YEAR(TODAY())-E66","v":24},{"$f":"VLOOKUP(F66,[1]Koefic!$A$1:$B$40,2,FALSE)","v":1},2.48]
[66,"Blāzmas iela","D",0.83,2000,24,{"$f":"VLOOKUP(F67,[1]Koefic!$A$1:$B$40,2,FALSE)","v":1},{"$f":"D67*G67","v":0.83}]
[67,"Briežu iela","D",0.83,2000,24,{"$f":"VLOOKUP(F68,[1]Koefic!$A$1:$B$40,2,FALSE)","v":1},0.83]
[68,"Brigaderes iela","D",0.83,2000,24,{"$f":"VLOOKUP(F69,[1]Koefic!$A$1:$B$40,2,FALSE)","v":1},0.83]
[69,"Brīvības bulvāris","B",2.48,2010,14,{"$f":"VLOOKUP(F70,[1]Koefic!$A$1:$B$40,2,FALSE)","v":1},2.48]
[70,"Bruģa iela","D",0.83,2024,0,{"$f":"VLOOKUP(F71,[1]Koefic!$A$1:$B$40,2,FALSE)","v":5},4.1499999999999995]
[71,"Brūkleņu iela","D",0.83,2000,24,{"$f":"VLOOKUP(F72,[1]Koefic!$A$1:$B$40,2,FALSE)","v":1},0.83]
[72,"Bumbieru ceļš","D",0.83,2000,24,{"$f":"VLOOKUP(F73,[1]Koefic!$A$1:$B$40,2,FALSE)","v":1},0.83]
[73,"Būriņu ceļa posms no Baložu ielas līdz Zemgaļu ielai","D",0.83,2000,24,{"$f":"VLOOKUP(F74,[1]Koefic!$A$1:$B$40,2,FALSE)","v":1},0.83]
[74,"Būriņu ceļa posms no Sniega ielas līdz Bāra ceļam","C",1.65,2000,24,{"$f":"VLOOKUP(F75,[1]Koefic!$A$1:$B$40,2,FALSE)","v":1},1.65]
[75,"Celtnieku ielas posms no Satiksmes ielas līdz Traktoristu ielai","D",0.83,2023,1,{"$f":"VLOOKUP(F76,[1]Koefic!$A$1:$B$40,2,FALSE)","v":5},4.1499999999999995]
[76,"Celtnieku ielas posms no Traktoristu ielas līdz Vasaras ielai","D",0.83,2000,24,{"$f":"VLOOKUP(F77,[1]Koefic!$A$1:$B$40,2,FALSE)","v":1},{"$f":"D77*G77","v":0.83}]
[77,"Cepļu iela","D",0.83,2021,3,{"$f":"VLOOKUP(F78,[1]Koefic!$A$1:$B$40,2,FALSE)","v":5},4.1499999999999995]
[78,"Ceriņu iela","D",0.83,2000,24,{"$f":"VLOOKUP(F79,[1]Koefic!$A$1:$B$40,2,FALSE)","v":1},0.83]
[79,"Ciedru iela","D",0.83,2000,24,{"$f":"VLOOKUP(F80,[1]Koefic!$A$1:$B$40,2,FALSE)","v":1},{"$f":"D80*G80","v":0.83}]
[80,"Ciema iela","D",0.83,2000,24,{"$f":"VLOOKUP(F81,[1]Koefic!$A$1:$B$40,2,FALSE)","v":1},{"$f":"D81*G81","v":0.83}]
[81,"Cīruļu iela","D",0.83,2000,24,{"$f":"VLOOKUP(F82,[1]Koefic!$A$1:$B$40,2,FALSE)","v":1},0.83]
[82,"Cukura iela","C",1.65,2014,10,{"$f":"VLOOKUP(F83,[1]Koefic!$A$1:$B$40,2,FALSE)","v":2},3.3]
[83,"Čiekuru iela","D",0.83,2024,0,{"$f":"VLOOKUP(F84,[1]Koefic!$A$1:$B$40,2,FALSE)","v":5},4.1499999999999995]
[84,"Dainas iela","D",0.83,2000,24,{"$f":"VLOOKUP(F85,[1]Koefic!$A$1:$B$40,2,FALSE)","v":1},0.83]
[85,"Dalbes iela","D",0.83,2000,24,{"$f":"VLOOKUP(F86,[1]Koefic!$A$1:$B$40,2,FALSE)","v":1},0.83]
[86,"Dambja ielas posms no Lielās ielas līdz Sarmas ielai","B",2.48,2000,24,{"$f":"VLOOKUP(F87,[1]Koefic!$A$1:$B$40,2,FALSE)","v":1},2.48]
[87,"Dambja ielas posms no Sarmas ielas līdz Mazajam ceļam","B",2.48,2017,7,{"$f":"VLOOKUP(F88,[1]Koefic!$A$1:$B$40,2,FALSE)","v":2},4.96]
[88,"Dambja ielas posms no Bebru ceļa līdz Atmodas ielai","B",2.48,2017,7,{"$f":"VLOOKUP(F89,[1]Koefic!$A$1:$B$40,2,FALSE)","v":2},4.96]
[89,"Dambja ielas posms no Atmodas ielas līdz Kārklu ielai","C",1.65,2017,7,{"$f":"VLOOKUP(F90,[1]Koefic!$A$1:$B$40,2,FALSE)","v":2},3.3]
[90,"Dārza iela","D",0.83,2021,3,{"$f":"VLOOKUP(F91,[1]Koefic!$A$1:$B$40,2,FALSE)","v":5},4.1499999999999995]
[91,"Dārzkopju iela","D",0.83,2000,24,{"$f":"VLOOKUP(F92,[1]Koefic!$A$1:$B$40,2,FALSE)","v":1},0.83]
[92,"Dīķa iela","D",0.83,2000,24,{"$f":"VLOOKUP(F93,[1]Koefic!$A$1:$B$40,2,FALSE)","v":1},0.83]
[93,"Dobeles iela","C",1.65,2010,14,{"$f":"VLOOKUP(F94,[1]Koefic!$A$1:$B$40,2,FALSE)","v":1},1.65]
[94,"Dobeles šoseja","A",4.13,2010,14,{"$f":"VLOOKUP(F95,[1]Koefic!$A$1:$B$40,2,FALSE)","v":1},4.13]
[95,"Draudzības iela","D",0.83,2000,24,{"$f":"VLOOKUP(F96,[1]Koefic!$A$1:$B$40,2,FALSE)","v":1},0.83]
[96,"Driksas ielas posms no Pasta ielas līdz Katoļu ielai","D",0.83,2000,24,{"$f":"VLOOKUP(F97,[1]Koefic!$A$1:$B$40,2,FALSE)","v":1},0.83]
[97,"Driksas ielas posms no Katoļu ielas līdz Akadēmijas ielai","C",1.65,2000,24,{"$f":"VLOOKUP(F98,[1]Koefic!$A$1:$B$40,2,FALSE)","v":1},1.65]
[98,"Driksas ielas posms no Akadēmijas ielas līdz Jāņa Čakstes bulvārim 7","D",0.83,2000,24,{"$f":"VLOOKUP(F99,[1]Koefic!$A$1:$B$40,2,FALSE)","v":1},0.83]
[99,"Druvienas iela","D",0.83,2000,24,{"$f":"VLOOKUP(F100,[1]Koefic!$A$1:$B$40,2,FALSE)","v":1},0.83]
[100,"Druvu iela","D",0.83,2015,9,{"$f":"VLOOKUP(F101,[1]Koefic!$A$1:$B$40,2,FALSE)","v":2},1.66]
[101,"Dūņu iela","D",0.83,2017,7,{"$f":"VLOOKUP(F102,[1]Koefic!$A$1:$B$40,2,FALSE)","v":2},1.66]
[102,"Dzelzceļnieku iela","D",0.83,2000,24,{"$f":"VLOOKUP(F103,[1]Koefic!$A$1:$B$40,2,FALSE)","v":1},0.83]
[103,"Dzērveņu iela","D",0.83,2000,24,{"$f":"VLOOKUP(F104,[1]Koefic!$A$1:$B$40,2,FALSE)","v":1},0.83]
[104,"Dzērves iela","D",0.83,2000,24,{"$f":"VLOOKUP(F105,[1]Koefic!$A$1:$B$40,2,FALSE)","v":1},0.83]
[105,"Dzirnavu ielas posms no Lietuvas šosejas līdz Dzirmavu ielai Nr.1","C",1.65,2019,5,{"$f":"VLOOKUP(F106,[1]Koefic!$A$1:$B$40,2,FALSE)","v":5},8.25]
[106,"Dzirnavu ielas posms no Dzirmavu ielas Nr.1 līdz Bauskas ielai","C",1.65,2000,{"$f":"YEAR(TODAY())-E107","v":24},{"$f":"VLOOKUP(F107,[1]Koefic!$A$1:$B$40,2,FALSE)","v":1},{"$f":"D107*G107","v":1.65}]
[107,"Eduarda Vedenbauma iela","D",0.83,2000,24,{"$f":"VLOOKUP(F108,[1]Koefic!$A$1:$B$40,2,FALSE)","v":1},0.83]
[108,"Egas ielas posms no Dambja ielas līdz Maija ielai","D",0.83,2021,3,{"$f":"VLOOKUP(F109,[1]Koefic!$A$1:$B$40,2,FALSE)","v":5},4.1499999999999995]
[109,"Egas ielas posms no Maija ielas līdz Sakņudārza ielai","D",0.83,2010,14,{"$f":"VLOOKUP(F110,[1]Koefic!$A$1:$B$40,2,FALSE)","v":1},0.83]
[110,"Egļu iela","D",0.83,2000,24,{"$f":"VLOOKUP(F111,[1]Koefic!$A$1:$B$40,2,FALSE)","v":1},0.83]
[111,"Elejas iela","D",0.83,2000,24,{"$f":"VLOOKUP(F112,[1]Koefic!$A$1:$B$40,2,FALSE)","v":1},{"$f":"D112*G112","v":0.83}]
[112,"Elektrības iela","D",0.83,2000,24,{"$f":"VLOOKUP(F113,[1]Koefic!$A$1:$B$40,2,FALSE)","v":1},{"$f":"D113*G113","v":0.83}]
[113,"Emburgas iela","D",0.83,2021,3,{"$f":"VLOOKUP(F114,[1]Koefic!$A$1:$B$40,2,FALSE)","v":5},4.1499999999999995]
[114,"Emīla Dārziņa iela no Kļavu ielas līdz Ausmas ielai","D",0.83,2024,0,{"$f":"VLOOKUP(F115,[1]Koefic!$A$1:$B$40,2,FALSE)","v":5},4.1499999999999995]
[115,"Emīla Dārziņa iela no Kļavu ielas līdz Augstkalnes ielai","D",0.83,2010,14,{"$f":"VLOOKUP(F116,[1]Koefic!$A$1:$B$40,2,FALSE)","v":1},0.83]
[116,"Emīla Dārziņa iela no Augstkalnes ielas līdz Rūpniecības ielai","D",0.83,2019,{"$f":"YEAR(TODAY())-E117","v":5},{"$f":"VLOOKUP(F117,[1]Koefic!$A$1:$B$40,2,FALSE)","v":5},{"$f":"D117*G117","v":4.1499999999999995}]
[117,"Emīla Melngaiļa  iela","D",0.83,2000,24,{"$f":"VLOOKUP(F118,[1]Koefic!$A$1:$B$40,2,FALSE)","v":1},0.83]
[118,"Ērgļu iela","D",0.83,2000,24,{"$f":"VLOOKUP(F119,[1]Koefic!$A$1:$B$40,2,FALSE)","v":1},0.83]
[119,"Filozofu ielas posms no Raiņa ielas līdz Rūpniecības ielai","B",2.48,2000,24,{"$f":"VLOOKUP(F120,[1]Koefic!$A$1:$B$40,2,FALSE)","v":1},2.48]
{"$rows_left_out":328}
{"sheet":"Koefic","index":3,"n_rows":40,"n_cols":2,"rows_kept":40,"hidden":true}
[0,5]
[1,5]
[2,5]
[3,5]
[4,5]
[5,5]
[6,2]
[7,2]
[8,2]
[9,2]
[10,2]
[11,1]
[12,1]
[13,1]
[14,1]
[15,1]
[16,1]
[17,1]
[18,1]
[19,1]
[20,1]
[21,1]
[22,1]
[23,1]
[24,1]
[25,1]
[26,1]
[27,1]
[28,1]
[29,1]
[30,1]
[31,1]
[32,1]
[33,1]
[34,1]
[35,1]
[36,1]
[37,1]
[38,1]
[39,1]